BDBM331627 Preparation of 2-(4-(6,7-dimethoxyquinoxalin-2-yl)phenyl)-N-(5-(1-(trifluoromethyl)cyclopropyl)isoxazol-3-yl)acetamide::US9725465, Example 1
SMILES COc1cc2ncc(nc2cc1OC)-c1ccc(CC(=O)Nc2cc(on2)C2(CC2)C(F)(F)F)cc1
InChI Key InChIKey=YJQLIMNVKRIHMJ-UHFFFAOYSA-N
Data  2 Kd
  Tab Delimited (TSV)   2D SDfile   Computed 3D by Vconf -m prep SDfile
Find this compound or compounds like it in BindingDB:
Activity Spreadsheet -- Enzyme Inhibition Constant Data from BindingDB
Found 1 hit for monomerid = 331627
TargetReceptor-type tyrosine-protein kinase FLT3(Homo sapiens (Human))
Ambit Biosciences
US Patent
LigandPNGBDBM331627(Preparation of 2-(4-(6,7-dimethoxyquinoxalin-2-yl)...)
Affinity DataKd: <5nM. Assay description: Competition binding assays used herein were developed, validated and performed as described in Fabian et al., Nature Biotechnology 2005, 23, 329-336....
Ligand InfoPC cidPC sid
In DepthDetails US Patent